Target
D(2) dopamine receptor
Ligand
BDBM50059239
Substrate
Meas. Tech.
ChEMBL_60373 (CHEMBL672209)
Ki
125±n/a nM
Citation
 Rowley, MCollins, IBroughton, HBDavey, WBBaker, REmms, FMarwood, RPatel, SPatel, SRagan, CIFreedman, SBBall, RLeeson, PD 4-Heterocyclylpiperidines as selective high-affinity ligands at the human dopamine D4 receptor. J Med Chem 40:2374-85 (1997)  
Target
Name:
D(2) dopamine receptor
Synonyms:
D(2) dopamine receptor DOPAMINE D2 Long DRD2 Dopamine D2 receptor Dopamine D2 receptor (D2R) Dopamine2-like | d2
Type:
Cell-surface receptors
Mol. Mass.:
50647.10
Organism:
Homo sapiens (Human)
Description:
P14416
Residue:
443
  
Inhibitor
Name:
BDBM50059239
Synonyms:
1-Benzyl-4-[5-(4-chloro-phenyl)-1H-pyrazol-3-yl]-piperidine | CHEMBL76090
Type:
Small organic molecule
Emp. Form.:
C21H22ClN3
Mol. Mass.:
351.872
SMILES:
Clc1ccc(cc1)-c1cc([nH]n1)C1CCN(Cc2ccccc2)CC1
: