Target
D(2) dopamine receptor
Ligand
BDBM50059233
Substrate
Meas. Tech.
ChEMBL_60373 (CHEMBL672209)
Ki
8.6±n/a nM
Citation
 Rowley, MCollins, IBroughton, HBDavey, WBBaker, REmms, FMarwood, RPatel, SPatel, SRagan, CIFreedman, SBBall, RLeeson, PD 4-Heterocyclylpiperidines as selective high-affinity ligands at the human dopamine D4 receptor. J Med Chem 40:2374-85 (1997)  
Target
Name:
D(2) dopamine receptor
Synonyms:
D(2) dopamine receptor DOPAMINE D2 Long DRD2 Dopamine D2 receptor Dopamine D2 receptor (D2R) Dopamine2-like | d2
Type:
Cell-surface receptors
Mol. Mass.:
50647.10
Organism:
Homo sapiens (Human)
Description:
P14416
Residue:
443
  
Inhibitor
Name:
BDBM50059233
Synonyms:
4-(1-Benzyl-piperidin-4-yl)-6-(4-chloro-phenyl)-pyrimidin-2-ylamine | CHEMBL78923
Type:
Small organic molecule
Emp. Form.:
C22H23ClN4
Mol. Mass.:
378.898
SMILES:
Nc1nc(cc(n1)-c1ccc(Cl)cc1)C1CCN(Cc2ccccc2)CC1
: