Target
D(2) dopamine receptor
Ligand
BDBM50059227
Substrate
Meas. Tech.
ChEMBL_60373 (CHEMBL672209)
Ki
66±n/a nM
Citation
 Rowley, MCollins, IBroughton, HBDavey, WBBaker, REmms, FMarwood, RPatel, SPatel, SRagan, CIFreedman, SBBall, RLeeson, PD 4-Heterocyclylpiperidines as selective high-affinity ligands at the human dopamine D4 receptor. J Med Chem 40:2374-85 (1997)  
Target
Name:
D(2) dopamine receptor
Synonyms:
D(2) dopamine receptor DOPAMINE D2 Long DRD2 Dopamine D2 receptor Dopamine D2 receptor (D2R) Dopamine2-like | d2
Type:
Cell-surface receptors
Mol. Mass.:
50647.10
Organism:
Homo sapiens (Human)
Description:
P14416
Residue:
443
  
Inhibitor
Name:
BDBM50059227
Synonyms:
1-Benzyl-4-(5-phenyl-1H-pyrazol-3-yl)-piperidine | CHEMBL25938
Type:
Small organic molecule
Emp. Form.:
C21H23N3
Mol. Mass.:
317.4274
SMILES:
C(N1CCC(CC1)c1cc(n[nH]1)-c1ccccc1)c1ccccc1
: