Target
Angiopoietin-1 receptor
Ligand
BDBM50507538
Substrate
Meas. Tech.
ChEMBL_1830401 (CHEMBL4330409)
IC50
0.360000±n/a nM
Citation
 Pan, XLiang, LSi, RWang, JZhang, QZhou, HZhang, LZhang, J Discovery of novel anti-angiogenesis agents. Part 10: Multi-target inhibitors of VEGFR-2, Tie-2 and EphB4 incorporated with 1,2,3-triazol. Eur J Med Chem 163:1-9 (2019)  
Target
Name:
Angiopoietin-1 receptor
Synonyms:
TEK TIE2_HUMAN Tyrosine-protein kinase receptor (TIE-2) Tyrosine-protein kinase receptor TEK (p140 TEK) Tyrosine-protein kinase receptor TIE2/TEK VMCM1 p140 TEK
Type:
Enzyme
Mol. Mass.:
125835.70
Organism:
Homo sapiens (Human)
Description:
Q02763
Residue:
1124
  
Inhibitor
Name:
BDBM50507538
Synonyms:
CHEMBL4452256
Type:
Small organic molecule
Emp. Form.:
C21H17ClN4O
Mol. Mass.:
376.839
SMILES:
COc1ccc(cn1)-c1ccc(Cn2cc(nn2)-c2cccc(Cl)c2)cc1
: