Target
Steroid 17-alpha-hydroxylase/17,20 lyase
Ligand
BDBM50061187
Substrate
Meas. Tech.
ChEMBL_50387 (CHEMBL662843)
IC50
1500±n/a nM
Citation
 Ling, YZLi, JSLiu, YKato, KKlus, GTBrodie, A 17-Imidazolyl, pyrazolyl, and isoxazolyl androstene derivatives. Novel steroidal inhibitors of human cytochrome C17,20-lyase (P450(17 alpha). J Med Chem 40:3297-304 (1997)  
Target
Name:
Steroid 17-alpha-hydroxylase/17,20 lyase
Synonyms:
CP17A_RAT Cyp17a1 Cytochrome P450 17A1 Steroid 17-alpha-hydroxylase/17,20 lyase
Type:
Enzyme
Mol. Mass.:
57255.68
Organism:
Rattus norvegicus (Rat)
Description:
P11715
Residue:
507
  
Inhibitor
Name:
BDBM50061187
Synonyms:
(10R,13S)-17-(1H-Imidazol-2-yl)-10,13-dimethyl-2,3,4,7,8,9,10,11,12,13,14,15,16,17-tetradecahydro-1H-cyclopenta[a]phenanthren-3-ol | CHEMBL419934
Type:
Small organic molecule
Emp. Form.:
C22H32N2O
Mol. Mass.:
340.5023
SMILES:
C[C@]12CCC3C(CC=C4CC(O)CC[C@]34C)C1CCC2c1ncc[nH]1
: