Target
Steroid 17-alpha-hydroxylase/17,20 lyase
Ligand
BDBM50408268
Substrate
Meas. Tech.
ChEMBL_50389 (CHEMBL662845)
IC50
5456±n/a nM
Citation
 Ling, YZLi, JSLiu, YKato, KKlus, GTBrodie, A 17-Imidazolyl, pyrazolyl, and isoxazolyl androstene derivatives. Novel steroidal inhibitors of human cytochrome C17,20-lyase (P450(17 alpha). J Med Chem 40:3297-304 (1997)  
Target
Name:
Steroid 17-alpha-hydroxylase/17,20 lyase
Synonyms:
CP17A_RAT Cyp17a1 Cytochrome P450 17A1 Steroid 17-alpha-hydroxylase/17,20 lyase
Type:
Enzyme
Mol. Mass.:
57255.68
Organism:
Rattus norvegicus (Rat)
Description:
P11715
Residue:
507
  
Inhibitor
Name:
BDBM50408268
Synonyms:
CHEMBL2112524
Type:
Small organic molecule
Emp. Form.:
C26H38N2O3
Mol. Mass.:
426.5915
SMILES:
CC(=O)O[C@H]1CC[C@]2(C)[C@H]3CC[C@@]4(C)[C@@H](CC[C@@H]4C4=NC(NC4)C(C)=O)[C@@H]3CC=C2C1
: