Target
Adenosine receptor A1
Ligand
BDBM10849
Substrate
Meas. Tech.
ChEMBL_28839 (CHEMBL876556)
Ki
41000±n/a nM
Citation
 Müller, CEGeis, UHipp, JSchobert, UFrobenius, WPawlowski, MSuzuki, FSandoval-Ramírez, J Synthesis and structure-activity relationships of 3,7-dimethyl-1-propargylxanthine derivatives, A2A-selective adenosine receptor antagonists. J Med Chem 40:4396-405 (1998)  
Target
Name:
Adenosine receptor A1
Synonyms:
AA1R_RAT ADENOSINE A1 high Adenosine A1 receptor (A1) Adenosine receptors A1 | Adora1
Type:
Protein
Mol. Mass.:
36704.13
Organism:
Rattus norvegicus (rat)
Description:
Residue:
326
  
Inhibitor
Name:
BDBM10849
Synonyms:
1,3,7-trimethyl-2,3,6,7-tetrahydro-1H-purine-2,6-dione CHEMBL113 caffeine
Type:
Small organic molecule
Emp. Form.:
C8H10N4O2
Mol. Mass.:
194.1906
SMILES:
Cn1cnc2n(C)c(=O)n(C)c(=O)c12
: