Target
Neutrophil collagenase
Ligand
BDBM50062304
Substrate
Meas. Tech.
ChEMBL_105205 (CHEMBL713844)
Ki
0.24±n/a nM
Citation
 Levy, DELapierre, FLiang, WYe, WLange, CWLi, XGrobelny, DCasabonne, MTyrrell, DHolme, KNadzan, AGalardy, RE Matrix metalloproteinase inhibitors: a structure-activity study. J Med Chem 41:199-223 (1998)  
Target
Name:
Neutrophil collagenase
Synonyms:
CLG1 MMP8 Matrix metalloproteinase-8 PMNL collagenase | PMNL-CL
Type:
Enzyme
Mol. Mass.:
53413.48
Organism:
Homo sapiens (Human)
Description:
P22894
Residue:
467
  
Inhibitor
Name:
BDBM50062304
Synonyms:
(R)-2-Hexyl-N*4*-hydroxy-N*1*-[(S)-2-(1H-indol-3-yl)-1-methylcarbamoyl-ethyl]-succinamide | CHEMBL71482
Type:
Small organic molecule
Emp. Form.:
C22H32N4O4
Mol. Mass.:
416.5139
SMILES:
CCCCCC[C@H](CC(=O)NO)C(=O)N[C@@H](Cc1c[nH]c2ccccc12)C(=O)NC
: