Target
Adenosine receptor A1
Ligand
BDBM50062856
Substrate
Meas. Tech.
ChEMBL_29122 (CHEMBL642256)
Ki
0.237±n/a nM
Citation
 Holschbach, MHFein, TKrummeich, CLewis, RGWutz, WSchwabe, UUnterlugauer, DOlsson, RA A1 adenosine receptor antagonists as ligands for positron emission tomography (PET) and single-photon emission tomography (SPET). J Med Chem 41:555-63 (1998)  
Target
Name:
Adenosine receptor A1
Synonyms:
AA1R_BOVIN ADENOSINE A1 high ADORA1 | Adenosine A1 receptor
Type:
Enzyme Catalytic Domain
Mol. Mass.:
36602.99
Organism:
BOVINE
Description:
ADENOSINE 0 BOVINE::P28190
Residue:
326
  
Inhibitor
Name:
BDBM50062856
Synonyms:
8-Cyclopentyl-3-((E)-3-iodo-propenyl)-1-propyl-3,7-dihydro-purine-2,6-dione | CHEMBL152488
Type:
Small organic molecule
Emp. Form.:
C16H21IN4O2
Mol. Mass.:
428.268
SMILES:
CCCn1c(=O)n(\C=C\CI)c2nc([nH]c2c1=O)C1CCCC1
: