Target
Alpha-1B adrenergic receptor
Ligand
BDBM50063906
Substrate
Meas. Tech.
ChEMBL_34323 (CHEMBL648106)
IC50
3.20±n/a nM
Citation
 Patane, MAScott, ALBroten, TPChang, RSRansom, RWDiSalvo, JForray, CBock, MG 4-Amino-2-[4-[1-(benzyloxycarbonyl)-2(S)- [[(1,1-dimethylethyl)amino]carbonyl]-piperazinyl]-6, 7-dimethoxyquinazoline (L-765,314): a potent and selective alpha1b adrenergic receptor antagonist. J Med Chem 41:1205-8 (1998)  
Target
Name:
Alpha-1B adrenergic receptor
Synonyms:
ADA1B_HUMAN Adrenergic alpha1B Adrenergic receptor alpha Alpha 1B-adrenoreceptor | Alpha-1B adrenergic receptor
Type:
Enzyme
Mol. Mass.:
56862.13
Organism:
Homo sapiens (Human)
Description:
P35368
Residue:
520
  
Inhibitor
Name:
BDBM50063906
Synonyms:
(S)-4-(4-Amino-6,7-dimethoxy-quinazolin-2-yl)-1-(furan-2-carbonyl)-piperazine-2-carboxylic acid tert-butylamide | CHEMBL19826
Type:
Small organic molecule
Emp. Form.:
C24H30N6O5
Mol. Mass.:
482.5322
SMILES:
COc1cc2nc(nc(N)c2cc1OC)N1CCN([C@@H](C1)C(=O)NC(C)(C)C)C(=O)c1ccco1
: