Target
Glutamate receptor ionotropic, NMDA 2C
Ligand
BDBM50064172
Substrate
Meas. Tech.
ChEMBL_154225 (CHEMBL760115)
Ki
>10000±n/a nM
Citation
 Quaglia, WGiannella, MPiergentili, APigini, MBrasili, LDi Toro, RRossetti, LSpampinato, SMelchiorre, C 1'-Benzyl-3,4-dihydrospiro[2H-1- benzothiopyran-2,4'-piperidine] (spipethiane), a potent and highly selective sigma1 ligand. J Med Chem 41:1557-60 (1998)  
Target
Name:
Glutamate receptor ionotropic, NMDA 2C
Synonyms:
Glutamate NMDA receptor; Grin1/Grin2c Grin2c NMDE3_RAT
Type:
Protein
Mol. Mass.:
135305.94
Organism:
Rattus norvegicus (Rat)
Description:
Q00961
Residue:
1237
  
Inhibitor
Name:
BDBM50064172
Synonyms:
1-benzylspiro[hexahydropyridine-4,2'-(3',4'-dihydro-2'H-thiochromene)] SPIPETHIANE
Type:
Small organic molecule
Emp. Form.:
C20H23NS
Mol. Mass.:
309.468
SMILES:
C(N1CCC2(CC1)CCc1ccccc1S2)c1ccccc1
: