Target
Prolyl 4-hydroxylase
Ligand
BDBM50396018
Substrate
Meas. Tech.
ChEMBL_1840409 (CHEMBL4340708)
IC50
47200±n/a nM
Citation
 Langley, GWAbboud, MILohans, CTSchofield, CJ Inhibition of a viral prolyl hydroxylase. Bioorg Med Chem 27:2405-2412 (2019)  
Target
Name:
Prolyl 4-hydroxylase
Synonyms:
A085R | Prolyl 4-hydroxylase
Type:
PROTEIN
Mol. Mass.:
27815.10
Organism:
Paramecium bursaria Chlorella virus 1
Description:
ChEMBL_119118
Residue:
242
  
Inhibitor
Name:
BDBM50396018
Synonyms:
CHEMBL1230640
Type:
Small organic molecule
Emp. Form.:
C10H7NO3
Mol. Mass.:
189.1675
SMILES:
OC(=O)c1ccc(O)c2ncccc12
: