Target
All-trans-retinol dehydrogenase [NAD(+)] ADH1B
Ligand
BDBM50064266
Substrate
Meas. Tech.
ChEMBL_31169 (CHEMBL641134)
Ki
330±n/a nM
Citation
 Schindler, JFBerst, KBPlapp, BV Inhibition of human alcohol dehydrogenases by formamides. J Med Chem 41:1696-701 (1998)  
Target
Name:
All-trans-retinol dehydrogenase [NAD(+)] ADH1B
Synonyms:
ADH1B ADH2 Alcohol dehydrogenase beta chain
Type:
PROTEIN
Mol. Mass.:
39864.68
Organism:
Homo sapiens (Human)
Description:
ChEMBL_31169
Residue:
375
  
Inhibitor
Name:
BDBM50064266
Synonyms:
CHEMBL43719 N-Heptyl-formamide
Type:
Small organic molecule
Emp. Form.:
C8H17NO
Mol. Mass.:
143.2267
SMILES:
CCCCCCCNC=O
: