Target
All-trans-retinol dehydrogenase [NAD(+)] ADH7
Ligand
BDBM50064280
Substrate
Meas. Tech.
ChEMBL_31173 (CHEMBL641138)
Ki
28000±n/a nM
Citation
 Schindler, JFBerst, KBPlapp, BV Inhibition of human alcohol dehydrogenases by formamides. J Med Chem 41:1696-701 (1998)  
Target
Name:
All-trans-retinol dehydrogenase [NAD(+)] ADH7
Synonyms:
ADH7 Alcohol dehydrogenase Alcohol dehydrogenase class IV Gastric alcohol dehydrogenase | Retinol dehydrogenase
Type:
PROTEIN
Mol. Mass.:
41487.40
Organism:
Homo sapiens (Human)
Description:
ChEMBL_31175
Residue:
386
  
Inhibitor
Name:
BDBM50064280
Synonyms:
CHEMBL295789 | N-Cyclopentyl-formamide
Type:
Small organic molecule
Emp. Form.:
C6H11NO
Mol. Mass.:
113.1576
SMILES:
O=CNC1CCCC1
: