Target
5-hydroxytryptamine receptor 1B
Ligand
BDBM30703
Substrate
Meas. Tech.
ChEMBL_1350 (CHEMBL616535)
Ki
14±n/a nM
Citation
 Law, HDukat, MTeitler, MLee, DKMazzocco, LKamboj, RRampersad, VPrisinzano, TGlennon, RA Benzylimidazolines as h5-HT1B/1D serotonin receptor ligands: a structure-affinity investigation. J Med Chem 41:2243-51 (1998)  
Target
Name:
5-hydroxytryptamine receptor 1B
Synonyms:
5-HT-1B 5-HT1B 5HT1B_HUMAN HTR1DB Serotonin (5-HT) receptor Serotonin Receptor 1B
Type:
G Protein-Coupled Receptor (GPCR)
Mol. Mass.:
43579.17
Organism:
Homo sapiens (Human)
Description:
Receptor binding assays were performed using human clone stably expressed in CHO cells
Residue:
390
  
Inhibitor
Name:
BDBM30703
Synonyms:
2-(4-tert-butyl-2,6-dimethyl-benzyl)-2-imidazoline;hydrochloride 2-[(4-tert-butyl-2,6-dimethylphenyl)methyl]-4,5-dihydro-1H-imidazole;hydrochloride MLS000069695 XYLOMETAZOLINE HYDROCHLORIDE cid_5282386
Type:
Small organic molecule
Emp. Form.:
C16H24N2
Mol. Mass.:
244.3752
SMILES:
Cc1cc(cc(C)c1CC1=NCCN1)C(C)(C)C
: