Target
5-hydroxytryptamine receptor 1D
Ligand
BDBM50064822
Substrate
Meas. Tech.
ChEMBL_1719 (CHEMBL875909)
Ki
1360±n/a nM
Citation
 Law, HDukat, MTeitler, MLee, DKMazzocco, LKamboj, RRampersad, VPrisinzano, TGlennon, RA Benzylimidazolines as h5-HT1B/1D serotonin receptor ligands: a structure-affinity investigation. J Med Chem 41:2243-51 (1998)  
Target
Name:
5-hydroxytryptamine receptor 1D
Synonyms:
5-HT-1D 5-HT1D 5HT1D_HUMAN HTR1DA Serotonin (5-HT) receptor | Serotonin Receptor 1D
Type:
G Protein-Coupled Receptor (GPCR)
Mol. Mass.:
41920.63
Organism:
Homo sapiens (Human)
Description:
Receptor binding assays were performed using human clone stably expressed in CHO cells.
Residue:
377
  
Inhibitor
Name:
BDBM50064822
Synonyms:
2-(4-tert-Butyl-2,6-dimethyl-phenyl)-ethylamine | CHEMBL72158
Type:
Small organic molecule
Emp. Form.:
C14H23N
Mol. Mass.:
205.3391
SMILES:
Cc1cc(cc(C)c1CCN)C(C)(C)C
: