Target
Gag-Pol polyprotein [489-587]
Ligand
BDBM160
Substrate
Meas. Tech.
ChEMBL_157733 (CHEMBL765171)
Ki
0.014±n/a nM
Citation
 De Lucca, GVKim, UTLiang, JCordova, BKlabe, RMGarber, SBacheler, LTLam, GNWright, MRLogue, KAErickson-Viitanen, SKo, SSTrainor, GL Nonsymmetric P2/P2' cyclic urea HIV protease inhibitors. Structure-activity relationship, bioavailability, and resistance profile of monoindazole-substituted P2 analogues. J Med Chem 41:2411-23 (1998)  
Target
Name:
Gag-Pol polyprotein [489-587]
Synonyms:
Human immunodeficiency virus type 1 protease Pol polyprotein | gag-pol
Type:
Enzyme Subunit
Mol. Mass.:
10781.16
Organism:
Human immunodeficiency virus type 1
Description:
P04585[489-587]
Residue:
99
  
Inhibitor
Name:
BDBM160
Synonyms:
3-{[(4R,5S,6S,7R)-4,7-dibenzyl-5,6-dihydroxy-3-{[3-(1H-imidazol-2-ylcarbamoyl)phenyl]methyl}-2-oxo-1,3-diazepan-1-yl]methyl}-N-(1H-imidazol-2-yl)benzamide Cyclic Urea
Type:
Emp. Form.:
C41H40N8O5
Mol. Mass.:
724.8069
SMILES:
O[C@@H]1[C@@H](O)[C@@H](Cc2ccccc2)N(Cc2cccc(c2)C(=O)Nc2ncc[nH]2)C(=O)N(Cc2cccc(c2)C(=O)Nc2ncc[nH]2)[C@@H]1Cc1ccccc1
: