Target
D(2) dopamine receptor
Ligand
BDBM50065556
Substrate
Meas. Tech.
ChEMBL_60973 (CHEMBL671591)
Ki
38.8±n/a nM
Citation
 Yasunaga, TKimura, TNaito, RKontani, TWanibuchi, FYamashita, HNomura, TTsukamoto, SYamaguchi, TMase, T Synthesis and pharmacological characterization of novel 6-fluorochroman derivatives as potential 5-HT1A receptor antagonists. J Med Chem 41:2765-78 (1998)  
Target
Name:
D(2) dopamine receptor
Synonyms:
DOPAMINE D2 DOPAMINE D2 Short Dopamine D2 receptor Drd2
Type:
G Protein-Coupled Receptor (GPCR)
Mol. Mass.:
50931.60
Organism:
Rattus norvegicus (rat)
Description:
P61169
Residue:
444
  
Inhibitor
Name:
BDBM50065556
Synonyms:
6-Fluoro-8-{2-[4-(4-methylsulfanyl-phenyl)-butylamino]-ethoxy}-chroman-4-one | CHEMBL96266
Type:
Small organic molecule
Emp. Form.:
C22H26FNO3S
Mol. Mass.:
403.51
SMILES:
CSc1ccc(CCCCNCCOc2cc(F)cc3C(=O)CCOc23)cc1
: