Target
B-cell lymphoma 6 protein
Ligand
BDBM50511628
Substrate
Meas. Tech.
ChEMBL_1845269 (CHEMBL4345696)
IC50
330±n/a nM
Target
Name:
B-cell lymphoma 6 protein
Synonyms:
B-cell lymphoma 5 protein BCL-5 BCL5 BCL6_HUMAN LAZ3 ZBTB27 Zinc finger and BTB domain-containing protein 27 | Zinc finger protein 51
Type:
PROTEIN
Mol. Mass.:
78866.89
Organism:
Homo sapiens
Description:
ChEMBL_117695
Residue:
706
  
Inhibitor
Name:
BDBM50511628
Synonyms:
CHEMBL4439574
Type:
Small organic molecule
Emp. Form.:
C23H29ClF2N6O2
Mol. Mass.:
494.965
SMILES:
CC1CN(CCC1(F)F)c1ncc(Cl)c(Nc2ccc3n(C)c(=O)n(CCC(C)(C)O)c3c2)n1
: