Target
B-cell lymphoma 6 protein
Ligand
BDBM50511636
Substrate
Meas. Tech.
ChEMBL_1845269 (CHEMBL4345696)
IC50
430±n/a nM
Target
Name:
B-cell lymphoma 6 protein
Synonyms:
B-cell lymphoma 5 protein BCL-5 BCL5 BCL6_HUMAN LAZ3 ZBTB27 Zinc finger and BTB domain-containing protein 27 | Zinc finger protein 51
Type:
PROTEIN
Mol. Mass.:
78866.89
Organism:
Homo sapiens
Description:
ChEMBL_117695
Residue:
706
  
Inhibitor
Name:
BDBM50511636
Synonyms:
CHEMBL4450499
Type:
Small organic molecule
Emp. Form.:
C21H24ClN7O2
Mol. Mass.:
441.914
SMILES:
Cc1ccnn1-c1ncc(Cl)c(Nc2ccc3n(C)c(=O)n(CCC(C)(C)O)c3c2)n1
: