Target
B-cell lymphoma 6 protein
Ligand
BDBM50511637
Substrate
Meas. Tech.
ChEMBL_1845269 (CHEMBL4345696)
IC50
790±n/a nM
Target
Name:
B-cell lymphoma 6 protein
Synonyms:
B-cell lymphoma 5 protein BCL-5 BCL5 BCL6_HUMAN LAZ3 ZBTB27 Zinc finger and BTB domain-containing protein 27 | Zinc finger protein 51
Type:
PROTEIN
Mol. Mass.:
78866.89
Organism:
Homo sapiens
Description:
ChEMBL_117695
Residue:
706
  
Inhibitor
Name:
BDBM50511637
Synonyms:
CHEMBL4467613
Type:
Small organic molecule
Emp. Form.:
C23H27ClN6O2
Mol. Mass.:
454.952
SMILES:
Cc1cc(C)n(n1)-c1cc(Nc2ccc3n(C)c(=O)n(CCC(C)(C)O)c3c2)c(Cl)cn1
: