Target
C5a anaphylatoxin chemotactic receptor 1
Ligand
BDBM50012295
Substrate
Meas. Tech.
ChEMBL_157421 (CHEMBL768726)
IC50
>1000000±n/a nM
Citation
 Wong, AKFinch, AMPierens, GKCraik, DJTaylor, SMFairlie, DP Small molecular probes for G-protein-coupled C5a receptors: conformationally constrained antagonists derived from the C terminus of the human plasma protein C5a. J Med Chem 41:3417-25 (1998)  
Target
Name:
C5a anaphylatoxin chemotactic receptor 1
Synonyms:
C5AR C5AR1_HUMAN C5a anaphylatoxin chemotactic receptor C5a-R | CD_antigen=CD88
Type:
Enzyme
Mol. Mass.:
39347.68
Organism:
Homo sapiens (Human)
Description:
P21730
Residue:
350
  
Inhibitor
Name:
BDBM50012295
Synonyms:
CHEMBL217378 Ile-Ser-His-Lys-Asp-Met-Gln-Leu-Gly-Arg
Type:
Small organic molecule
Emp. Form.:
C49H85N17O15S
Mol. Mass.:
1184.369
SMILES:
CC[C@H](C)[C@H](N)C(=O)N[C@@H](CO)C(=O)N[C@@H](Cc1cnc[nH]1)C(=O)N[C@@H](CCCCN)C(=O)N[C@@H](CC(O)=O)C(=O)N[C@@H](CCSC)C(=O)N[C@@H](CCC(N)=O)C(=O)N[C@@H](CC(C)C)C(=O)NCC(=O)N[C@@H](CCCNC(N)=N)C(O)=O
: