Target
Virulence factor transcriptional regulator MvfR
Ligand
BDBM50512173
Substrate
Meas. Tech.
ChEMBL_1848045 (CHEMBL4348586)
IC50
3900±n/a nM
Citation
 Soheili, VTajani, ASGhodsi, RBazzaz, BSF Anti-PqsR compounds as next-generation antibacterial agents against Pseudomonas aeruginosa: A review. Eur J Med Chem 172:26-35 (2019)  
Target
Name:
Virulence factor transcriptional regulator MvfR
Synonyms:
Transcriptional regulator MvfR
Type:
PROTEIN
Mol. Mass.:
37217.11
Organism:
Pseudomonas aeruginosa PA14
Description:
ChEMBL_107649
Residue:
332
  
Inhibitor
Name:
BDBM50512173
Synonyms:
CHEMBL4521273
Type:
Small organic molecule
Emp. Form.:
C17H24FN3O
Mol. Mass.:
305.3904
SMILES:
CCCCCCCCCc1nc2cc(F)ccc2c(=O)n1N
: