Target
Adenosine receptor A3
Ligand
BDBM50059376
Substrate
Meas. Tech.
ChEMBL_31999 (CHEMBL646596)
Ki
172±n/a nM
Citation
 van Muijlwijk-Koezen, JETimmerman, HLink, Rvan der Goot, HIJzerman, AP A novel class of adenosine A3 receptor ligands. 1. 3-(2-Pyridinyl)isoquinoline derivatives. J Med Chem 41:3987-93 (1998)  
Target
Name:
Adenosine receptor A3
Synonyms:
A3 adenosine receptor (hA3) ADORA3 | Adenosine A3 receptor (A3AR)
Type:
G Protein-Coupled Receptor (GPCR)
Mol. Mass.:
36197.32
Organism:
Homo sapiens (Human)
Description:
P0DMS8
Residue:
318
  
Inhibitor
Name:
BDBM50059376
Synonyms:
9-Methyl-2-phenyl-5,9-dihydro-[1,2,4]triazolo[5,1-a][2,7]naphthyridine-6-carboxylic acid methyl ester L-249313
Type:
Small organic molecule
Emp. Form.:
C18H16N4O2
Mol. Mass.:
320.3452
SMILES:
COC(=O)C1=C2C=CN(C)C=C2c2nc(nn2C1)-c1ccccc1
: