Target
Cannabinoid receptor 1
Ligand
BDBM50067497
Substrate
Meas. Tech.
ChEMBL_46809 (CHEMBL659695)
Ki
0.11±n/a nM
Citation
 Tong, WCollantes, ERWelsh, WJBerglund, BAHowlett, AC Derivation of a pharmacophore model for anandamide using constrained conformational searching and comparative molecular field analysis. J Med Chem 41:4207-15 (1998)  
Target
Name:
Cannabinoid receptor 1
Synonyms:
Brain-type cannabinoid receptor CB-R CNR1_RAT Cannabinoid receptor Cnr1 | Skr6
Type:
G Protein-Coupled Receptor (GPCR)
Mol. Mass.:
52856.55
Organism:
Rattus norvegicus (rat)
Description:
P20272
Residue:
473
  
Inhibitor
Name:
BDBM50067497
Synonyms:
(2S,4S,4aS,6R,8aR)-4-[4-(1,1-Dimethyl-heptyl)-2-hydroxy-phenyl]-6-hydroxymethyl-decahydro-naphthalen-2-ol CP-55244
Type:
Small organic molecule
Emp. Form.:
C26H42O3
Mol. Mass.:
402.6099
SMILES:
CCCCCCC(C)(C)c1ccc([C@H]2C[C@@H](O)C[C@H]3CC[C@@H](CO)C[C@H]23)c(O)c1
: