Target
Chymase
Ligand
BDBM50068889
Substrate
Meas. Tech.
ChEBML_49442
Ki
6.3±n/a nM
Citation
 Eda, MAshimori, AAkahoshi, FYoshimura, TInoue, YFukaya, CNakajima, MFukuyama, HImada, TTakai, SShiota, NMiyazaki, MNakamura, N Peptidyl human heart chymase inhibitors. 1. Synthesis and inhibitory activity of difluoromethylene ketone derivatives bearing P' binding subsites. Bioorg Med Chem Lett 8:913-8 (1999)  
Target
Name:
Chymase
Synonyms:
Alpha-chymase CMA1_HUMAN CYM Mast cell protease I
Type:
Enzyme
Mol. Mass.:
27340.12
Organism:
Homo sapiens (Human)
Description:
Residue:
247
  
Inhibitor
Name:
BDBM50068889
Synonyms:
3-(4-{[(S)-1-((S)-2-Benzenesulfonylamino-3-methyl-butyryl)-pyrrolidine-2-carbonyl]-amino}-2,2-difluoro-3-oxo-5-phenyl-pentanoylamino)-benzoic acid | CHEMBL170878
Type:
Small organic molecule
Emp. Form.:
C34H36F2N4O8S
Mol. Mass.:
698.733
SMILES:
CC(C)[C@H](NS(=O)(=O)c1ccccc1)C(=O)N1CCC[C@H]1C(=O)NC(Cc1ccccc1)C(=O)C(F)(F)C(=O)Nc1cccc(c1)C(O)=O
: