Target
Chymotrypsin-C
Ligand
BDBM50068915
Substrate
Meas. Tech.
ChEBML_49617
Ki
3950±n/a nM
Citation
 Eda, MAshimori, AAkahoshi, FYoshimura, TInoue, YFukaya, CNakajima, MFukuyama, HImada, TTakai, SShiota, NMiyazaki, MNakamura, N Peptidyl human heart chymase inhibitors. 2. Discovery of highly selective difluoromethylene ketone derivatives with Glu at P3 site. Bioorg Med Chem Lett 8:919-24 (1999)  
Target
Name:
Chymotrypsin-C
Synonyms:
CLCR CTRC_HUMAN Chymotrypsin Chymotrypsin-C
Type:
Enzyme
Mol. Mass.:
29487.98
Organism:
Homo sapiens (Human)
Description:
Q99895
Residue:
268
  
Inhibitor
Name:
BDBM50068915
Synonyms:
5-{(S)-2-[1-Benzyl-3-(3-carboxymethyl-phenylcarbamoyl)-3,3-difluoro-2-oxo-propylcarbamoyl]-pyrrolidin-1-yl}-4-tert-butoxycarbonylamino-5-oxo-pentanoic acid | CHEMBL170697
Type:
Small organic molecule
Emp. Form.:
C34H40F2N4O10
Mol. Mass.:
702.699
SMILES:
CC(C)(C)OC(=O)NC(CCC(O)=O)C(=O)N1CCC[C@H]1C(=O)NC(Cc1ccccc1)C(=O)C(F)(F)C(=O)Nc1cccc(CC(O)=O)c1
: