Target
Serine protease 1
Ligand
BDBM50069194
Substrate
Meas. Tech.
ChEBML_212736
Ki
3000±n/a nM
Citation
 Sanderson, PECutrona, KJDorsey, BDDyer, DLMcDonough, CMNaylor-Olsen, AMChen, IWChen, ZCook, JJGardell, SJKrueger, JALewis, SDLin, JHLucas, BJLyle, EALynch, JJStranieri, MTVastag, KShafer, JAVacca, JP L-374,087, an efficacious, orally bioavailable, pyridinone acetamide thrombin inhibitor. Bioorg Med Chem Lett 8:817-22 (1999)  
Target
Name:
Serine protease 1
Synonyms:
Alpha-trypsin chain 1 Beta-trypsin PRSS1 TRP1 TRY1_HUMAN Thrombin & trypsin Trypsin I | Trypsin-1
Type:
Enzyme
Mol. Mass.:
26557.80
Organism:
Homo sapiens (Human)
Description:
P07477
Residue:
247
  
Inhibitor
Name:
BDBM50069194
Synonyms:
CHEMBL355441 | N-(6-Amino-pyridin-3-ylmethyl)-2-(6-methyl-2-oxo-3-phenylmethanesulfonylamino-2H-pyridin-1-yl)-acetamide
Type:
Small organic molecule
Emp. Form.:
C21H23N5O4S
Mol. Mass.:
441.503
SMILES:
Cc1ccc(NS(=O)(=O)Cc2ccccc2)c(=O)n1CC(=O)NCc1ccc(N)nc1
: