Target
Mu-type opioid receptor
Ligand
BDBM50353747
Substrate
Meas. Tech.
ChEMBL_1859869 (CHEMBL4360725)
Ki
>10000±n/a nM
Citation
 Dvorácskó, SKeresztes, AMollica, AStefanucci, AMacedonio, GPieretti, SZádor, FWalter, FRDeli, MAKékesi, GBánki, LTuboly, GHorváth, GTömböly, C Preparation of bivalent agonists for targeting the mu opioid and cannabinoid receptors. Eur J Med Chem 178:571-588 (2019)  
Target
Name:
Mu-type opioid receptor
Synonyms:
MOR-1 Mu-type opioid receptor (MOR) OPRM_RAT Opioid receptor B Ror-b
Type:
G Protein-Coupled Receptor (GPCR)
Mol. Mass.:
44503.11
Organism:
Rattus norvegicus (rat)
Description:
Competition binding assays were carried out using membrane preparations from transfected HN9.10 cells that constitutively expressed the mu opioid receptor.
Residue:
398
  
Inhibitor
Name:
BDBM50353747
Synonyms:
CHEMBL561013 | JWH-018
Type:
Small organic molecule
Emp. Form.:
C24H23NO
Mol. Mass.:
341.4455
SMILES:
CCCCCn1cc(C(=O)c2cccc3ccccc23)c2ccccc12
: