Target
Adenosine deaminase
Ligand
BDBM50070646
Substrate
Meas. Tech.
ChEBML_30791
Ki
0.760000±n/a nM
Citation
 Curtis, MAVarkhedkar, VPragnacharyulu, PVAbushanab, E Adenosine deaminase inhibitors. Synthesis and biological evaluation of aralkyladenines (ARADS). Bioorg Med Chem Lett 8:1639-42 (1999)  
Target
Name:
Adenosine deaminase
Synonyms:
ADA Adenosine aminohydrolase
Type:
Enzyme
Mol. Mass.:
40910.44
Organism:
Bos taurus (bovine)
Description:
Residue:
363
  
Inhibitor
Name:
BDBM50070646
Synonyms:
(2S,3R)-3-(6-Amino-purin-9-yl)-7-phenyl-heptan-2-ol CHEMBL295003
Type:
Small organic molecule
Emp. Form.:
C18H23N5O
Mol. Mass.:
325.4081
SMILES:
C[C@H](O)[C@@H](CCCCc1ccccc1)n1cnc2c(N)ncnc12
: