Target
Alpha-1A adrenergic receptor
Ligand
BDBM50033111
Substrate
Meas. Tech.
ChEMBL_32877 (CHEMBL648630)
Ki
32±n/a nM
Citation
 Nerenberg, JBErb, JMThompson, WJLee, HYGuare, JPMunson, PMBergman, JMHuff, JRBroten, TPChang, RSChen, TBO'Malley, SSchorn, TWScott, AL Design and synthesis of N-alkylated saccharins as selective alpha-1a adrenergic receptor antagonists. Bioorg Med Chem Lett 8:2467-72 (1999)  
Target
Name:
Alpha-1A adrenergic receptor
Synonyms:
ADA1A_HUMAN ADRA1C Alpha 1A-adrenoceptor Alpha adrenergic receptor 1a Alpha-adrenergic receptor 1c adrenergic Alpha1 | adrenergic Alpha1C
Type:
Cell-surface receptors
Mol. Mass.:
51511.67
Organism:
Homo sapiens (Human)
Description:
P35348
Residue:
466
  
Inhibitor
Name:
BDBM50033111
Synonyms:
1-(4-Amino-6,7-dimethoxy-2-quinazolinyl)-4-((tetrahydro-2-furanyl)carbonyl)piperazine CHEMBL611 Terazosine
Type:
Small organic molecule
Emp. Form.:
C19H25N5O4
Mol. Mass.:
387.4329
SMILES:
COc1cc2nc(nc(N)c2cc1OC)N1CCN(CC1)C(=O)C1CCCO1
: