Target
Alpha-1A adrenergic receptor
Ligand
BDBM50071658
Substrate
Meas. Tech.
ChEMBL_32881 (CHEMBL648785)
Ki
2.4±n/a nM
Citation
 Nerenberg, JBErb, JMThompson, WJLee, HYGuare, JPMunson, PMBergman, JMHuff, JRBroten, TPChang, RSChen, TBO'Malley, SSchorn, TWScott, AL Design and synthesis of N-alkylated saccharins as selective alpha-1a adrenergic receptor antagonists. Bioorg Med Chem Lett 8:2467-72 (1999)  
Target
Name:
Alpha-1A adrenergic receptor
Synonyms:
ADA1A_HUMAN ADRA1C Alpha 1A-adrenoceptor Alpha adrenergic receptor 1a Alpha-adrenergic receptor 1c adrenergic Alpha1 | adrenergic Alpha1C
Type:
Cell-surface receptors
Mol. Mass.:
51511.67
Organism:
Homo sapiens (Human)
Description:
P35348
Residue:
466
  
Inhibitor
Name:
BDBM50071658
Synonyms:
3-{1-[4-(6-Methanesulfonyl-1,1,3-trioxo-1,3-dihydro-1lambda*6*-benzo[d]isothiazol-2-yl)-butyl]-piperidin-4-yl}-3H-benzooxazol-2-one | CHEMBL81173
Type:
Small organic molecule
Emp. Form.:
C24H27N3O7S2
Mol. Mass.:
533.617
SMILES:
CS(=O)(=O)c1ccc2C(=O)N(CCCCN3CCC(CC3)n3c4ccccc4oc3=O)S(=O)(=O)c2c1
: