Target
Acetyl-coenzyme A synthetase, cytoplasmic
Ligand
BDBM50517066
Substrate
Meas. Tech.
ChEMBL_1867284 (CHEMBL4368259)
IC50
3.9±n/a nM
Citation
 Kargbo, RB Inhibition of ACSS2 for Treatment of Cancer and Neuropsychiatric Diseases. ACS Med Chem Lett 10:1100-1101 (2019)  
Target
Name:
Acetyl-coenzyme A synthetase, cytoplasmic
Synonyms:
6.2.1.1 ACAS2 ACSA_HUMAN AceCS Acetate--CoA ligase Acetyl-CoA synthetase 1 Acyl-CoA synthetase short-chain family member 2 Propionate--CoA ligase
Type:
PROTEIN
Mol. Mass.:
78577.73
Organism:
Homo sapiens
Description:
ChEMBL_119217
Residue:
701
  
Inhibitor
Name:
BDBM50517066
Synonyms:
CHEMBL4476365
Type:
Small organic molecule
Emp. Form.:
C21H18N4O4
Mol. Mass.:
390.392
SMILES:
COc1ccc(cn1)N1N=C(C)C(C(=O)Nc2cccc(c2)-c2ccco2)C1=O
: