Target
Oxytocin receptor
Ligand
BDBM50072365
Substrate
Meas. Tech.
ChEBML_149050
Ki
7.3±n/a nM
Citation
 Kuo, MSBock, MGFreidinger, RMGuidotti, MTLis, EVPawluczyk, JMPerlow, DSPettibone, DJQuigley, AGReiss, DRWilliams, PDWoyden, CJ Nonpeptide oxytocin antagonists: potent, orally bioavailable analogs of L-371,257 containing a 1-R-(pyridyl)ethyl ether terminus. Bioorg Med Chem Lett 8:3081-6 (1999)  
Target
Name:
Oxytocin receptor
Synonyms:
OT-R OXYR_HUMAN | Oxytocin
Type:
Enzyme Catalytic Domain
Mol. Mass.:
42793.26
Organism:
Homo sapiens (Human)
Description:
Oxytocin OXTR HEK293::B2R9L7
Residue:
389
  
Inhibitor
Name:
BDBM50072365
Synonyms:
1-(1-{5-Fluoro-2-methoxy-4-[(R)-1-(1-oxy-pyridin-4-yl)-ethoxy]-benzoyl}-piperidin-4-yl)-1,4-dihydro-benzo[d][1,3]oxazin-2-one | CHEMBL105514
Type:
Small organic molecule
Emp. Form.:
C28H28FN3O6
Mol. Mass.:
521.5368
SMILES:
COc1cc(O[C@H](C)c2cc[n+]([O-])cc2)c(F)cc1C(=O)N1CCC(CC1)N1C(=O)OCc2ccccc12
: