Target
Tissue alpha-L-fucosidase
Ligand
BDBM50072588
Substrate
Meas. Tech.
ChEMBL_216283 (CHEMBL819889)
Ki
5.8±n/a nM
Citation
 Witczak, ZJBoryczewski, D Thio-sugars. IV: Design and synthesis of S-linked fucoside analogs as a new class of alpha-L-fucosidase inhibitors. Bioorg Med Chem Lett 8:3265-8 (1999)  
Target
Name:
Tissue alpha-L-fucosidase
Synonyms:
Alpha-L-fucosidase I FUCA1 Tissue alpha-L-fucosidase
Type:
PROTEIN
Mol. Mass.:
53690.69
Organism:
Homo sapiens (Human)
Description:
ChEMBL_34088
Residue:
466
  
Inhibitor
Name:
BDBM50072588
Synonyms:
(2S,3R,4R,5R,6S)-2-Hydroxymethyl-6-methyl-piperidine-3,4,5-triol CHEMBL69294
Type:
Small organic molecule
Emp. Form.:
C7H15NO4
Mol. Mass.:
177.1983
SMILES:
CC1NC(CO)[C@@H](O)[C@@H](O)[C@@H]1O
: