Target
Gag-Pol polyprotein [489-587]
Ligand
BDBM50054184
Substrate
Meas. Tech.
ChEMBL_157551 (CHEMBL763303)
Ki
0.014±n/a nM
Citation
 Debnath, AK Three-dimensional quantitative structure-activity relationship study on cyclic urea derivatives as HIV-1 protease inhibitors: application of comparative molecular field analysis. J Med Chem 42:249-59 (1999)  
Target
Name:
Gag-Pol polyprotein [489-587]
Synonyms:
Human immunodeficiency virus type 1 protease Pol polyprotein | gag-pol
Type:
Enzyme Subunit
Mol. Mass.:
10781.16
Organism:
Human immunodeficiency virus type 1
Description:
P04585[489-587]
Residue:
99
  
Inhibitor
Name:
BDBM50054184
Synonyms:
2-{3-[4,7-dibenzyl-5,6-dihydroxy-3-[3-(5-methyl-1,3-thiazol-2-ylcarbamoyl)benzyl]-2-oxo-(4R,5S,6S,7R)-1,3-diazepan-1-ylmethyl]phenylcarboxamido}-5-methyl-1,3-thiazole | CHEMBL313959
Type:
Small organic molecule
Emp. Form.:
C43H42N6O5S2
Mol. Mass.:
786.961
SMILES:
Cc1cnc(NC(=O)c2cccc(CN3[C@H](Cc4ccccc4)[C@H](O)[C@@H](O)[C@@H](Cc4ccccc4)N(Cc4cccc(c4)C(=O)Nc4ncc(C)s4)C3=O)c2)s1
: