Target
Receptor-interacting serine/threonine-protein kinase 3
Ligand
BDBM50428286
Substrate
Meas. Tech.
ChEMBL_1877353 (CHEMBL4378747)
IC50
250±n/a nM
Citation
 Zhuang, CChen, F Small-Molecule Inhibitors of Necroptosis: Current Status and Perspectives. J Med Chem 63:1490-1510 (2020)  
Target
Name:
Receptor-interacting serine/threonine-protein kinase 3
Synonyms:
RIP-3 RIP3 RIPK3_HUMAN | Receptor-interacting protein 3
Type:
PROTEIN
Mol. Mass.:
56886.12
Organism:
Homo sapiens (Human)
Description:
ChEMBL_881455
Residue:
518
  
Inhibitor
Name:
BDBM50428286
Synonyms:
DABRAFENIB | GSK2118436A
Type:
Small organic molecule
Emp. Form.:
C23H20F3N5O2S2
Mol. Mass.:
519.562
SMILES:
CC(C)(C)c1nc(c(s1)-c1ccnc(N)n1)-c1cccc(NS(=O)(=O)c2c(F)cccc2F)c1F
: