Target
Receptor-interacting serine/threonine-protein kinase 2
Ligand
BDBM50428286
Substrate
Meas. Tech.
ChEMBL_1877355 (CHEMBL4378749)
IC50
77±n/a nM
Citation
 Zhuang, CChen, F Small-Molecule Inhibitors of Necroptosis: Current Status and Perspectives. J Med Chem 63:1490-1510 (2020)  
Target
Name:
Receptor-interacting serine/threonine-protein kinase 2
Synonyms:
CARDIAK RIP2 RIPK2_HUMAN Tyrosine-protein kinase RIPK2 | receptor-interacting serine/threonine-protein kinase 2
Type:
Protein
Mol. Mass.:
61201.30
Organism:
Homo sapiens (Human)
Description:
Residue:
540
  
Inhibitor
Name:
BDBM50428286
Synonyms:
DABRAFENIB | GSK2118436A
Type:
Small organic molecule
Emp. Form.:
C23H20F3N5O2S2
Mol. Mass.:
519.562
SMILES:
CC(C)(C)c1nc(c(s1)-c1ccnc(N)n1)-c1cccc(NS(=O)(=O)c2c(F)cccc2F)c1F
: