Target
Adenosine receptor A3
Ligand
BDBM50074220
Substrate
Meas. Tech.
ChEMBL_31865 (CHEMBL644094)
Ki
4.22±n/a nM
Citation
 Li, AHMoro, SForsyth, NMelman, NJi, XDJacobson, KA Synthesis, CoMFA analysis, and receptor docking of 3,5-diacyl-2, 4-dialkylpyridine derivatives as selective A3 adenosine receptor antagonists. J Med Chem 42:706-21 (1999)  
Target
Name:
Adenosine receptor A3
Synonyms:
A3 adenosine receptor (hA3) ADORA3 | Adenosine A3 receptor (A3AR)
Type:
G Protein-Coupled Receptor (GPCR)
Mol. Mass.:
36197.32
Organism:
Homo sapiens (Human)
Description:
P0DMS8
Residue:
318
  
Inhibitor
Name:
BDBM50074220
Synonyms:
4,6-Diethyl-5-ethylsulfanylcarbonyl-2-phenyl-nicotinic acid 2-fluoro-ethyl ester | CHEMBL164321
Type:
Small organic molecule
Emp. Form.:
C21H24FNO3S
Mol. Mass.:
389.484
SMILES:
CCSC(=O)c1c(CC)nc(-c2ccccc2)c(C(=O)OCCF)c1CC
: