Target
B-cell lymphoma 6 protein
Ligand
BDBM50520219
Substrate
Meas. Tech.
ChEMBL_1879422 (CHEMBL4380816)
IC50
860±n/a nM
Citation
 Guo, WXing, YZhang, QXie, JHuang, DGu, HHe, PZhou, MXu, SPang, XLiu, MYi, ZChen, Y Synthesis and Biological Evaluation of B-Cell Lymphoma 6 Inhibitors of  J Med Chem 63:676-695 (2020)  
Target
Name:
B-cell lymphoma 6 protein
Synonyms:
B-cell lymphoma 5 protein BCL-5 BCL5 BCL6_HUMAN LAZ3 ZBTB27 Zinc finger and BTB domain-containing protein 27 | Zinc finger protein 51
Type:
PROTEIN
Mol. Mass.:
78866.89
Organism:
Homo sapiens
Description:
ChEMBL_117695
Residue:
706
  
Inhibitor
Name:
BDBM50520219
Synonyms:
CHEMBL4530646
Type:
Small organic molecule
Emp. Form.:
C14H16ClFN4O2
Mol. Mass.:
326.754
SMILES:
COc1ccc(Nc2nc(NCCCO)ncc2F)cc1Cl
: