Target
B-cell lymphoma 6 protein
Ligand
BDBM50520232
Substrate
Meas. Tech.
ChEMBL_1879422 (CHEMBL4380816)
IC50
770±n/a nM
Citation
 Guo, WXing, YZhang, QXie, JHuang, DGu, HHe, PZhou, MXu, SPang, XLiu, MYi, ZChen, Y Synthesis and Biological Evaluation of B-Cell Lymphoma 6 Inhibitors of  J Med Chem 63:676-695 (2020)  
Target
Name:
B-cell lymphoma 6 protein
Synonyms:
B-cell lymphoma 5 protein BCL-5 BCL5 BCL6_HUMAN LAZ3 ZBTB27 Zinc finger and BTB domain-containing protein 27 | Zinc finger protein 51
Type:
PROTEIN
Mol. Mass.:
78866.89
Organism:
Homo sapiens
Description:
ChEMBL_117695
Residue:
706
  
Inhibitor
Name:
BDBM50520232
Synonyms:
CHEMBL4446667
Type:
Small organic molecule
Emp. Form.:
C17H21ClFN5O
Mol. Mass.:
365.833
SMILES:
COc1ccc(Nc2nc(ncc2F)N2C[C@H](C)N[C@H](C)C2)cc1Cl
: