Target
Replicase polyprotein 1ab
Ligand
BDBM50384265
Substrate
Meas. Tech.
ChEMBL_1891486 (CHEMBL4393313)
Kd
7600±n/a nM
Citation
 Lee, HRen, JPesavento, RPOjeda, IRice, AJLv, HKwon, YJohnson, ME Identification and design of novel small molecule inhibitors against MERS-CoV papain-like protease via high-throughput screening and molecular modeling. Bioorg Med Chem 27:1981-1989 (2019)  
Target
Name:
Replicase polyprotein 1ab
Synonyms:
2.1.1.- 3.1.-.- 3.4.19.12 3.4.22.69 3.6.4.13 3CL-PRO ExoN Growth factor-like peptide Hel Host translation inhibitor nsp1 NendoU Non-structural protein 2 Non-structural protein 4 Non-structural protein 7 Non-structural protein 9 PL-PRO Pol RNA-directed RNA polymerase Replicase polyprotein 1ab nsp1 nsp12 nsp14 nsp16 nsp3 nsp5 nsp7 nsp9 pp1ab | rep
Type:
PROTEIN
Mol. Mass.:
789589.93
Organism:
Middle East respiratory syndrome-related coronavirus (isolate UnitedKingdom/H123990006/2012) (Betacoronavirus England 1) (Humancoronavirus EMC)
Description:
ChEMBL_117802
Residue:
7078
  
Inhibitor
Name:
BDBM50384265
Synonyms:
CHEMBL2030452
Type:
Small organic molecule
Emp. Form.:
C20H23N3OS
Mol. Mass.:
353.481
SMILES:
Cc1ccc(C)c(CSc2nc(C3CCCCC3)c(C#N)c(=O)[nH]2)c1
: