Target
Adenosine receptor A2a
Ligand
BDBM50450928
Substrate
Meas. Tech.
ChEBML_30903
IC50
100±n/a nM
Citation
 Kuroda, SAkahane, AItani, HNishimura, SDurkin, KKinoshita, TTenda, YSakane, K Discovery of FR166124, a novel water-soluble pyrazolo-[1,5-a]pyridine adenosine A1 receptor antagonist. Bioorg Med Chem Lett 9:1979-84 (1999)  
Target
Name:
Adenosine receptor A2a
Synonyms:
AA2AR_RAT Adenosine A2 receptor Adenosine Receptors A2a (A2a) Adenosine receptors A2a Rat striatal adenosine A2a receptor
Type:
G Protein-Coupled Receptor (GPCR)
Mol. Mass.:
45015.65
Organism:
Rattus norvegicus (rat)
Description:
Rat A2A receptors expressed in CHO cells.
Residue:
410
  
Inhibitor
Name:
BDBM50450928
Synonyms:
CHEMBL2113728
Type:
Small organic molecule
Emp. Form.:
C25H24N4O3
Mol. Mass.:
428.4831
SMILES:
OC(=O)C[C@@H]1CCCC[C@H]1n1nc(ccc1=O)-c1c(nn2ccccc12)-c1ccccc1
: