Target
Adenosine receptor A1
Ligand
BDBM50080400
Substrate
Meas. Tech.
ChEMBL_29611 (CHEMBL642893)
Ki
4.7±n/a nM
Citation
 Knutsen, LJLau, JPetersen, HThomsen, CWeis, JUShalmi, MJudge, MEHansen, AJSheardown, MJ N-substituted adenosines as novel neuroprotective A(1) agonists with diminished hypotensive effects. J Med Chem 42:3463-77 (1999)  
Target
Name:
Adenosine receptor A1
Synonyms:
AA1R_RAT ADENOSINE A1 high Adenosine A1 receptor (A1) Adenosine receptors A1 | Adora1
Type:
Protein
Mol. Mass.:
36704.13
Organism:
Rattus norvegicus (rat)
Description:
Residue:
326
  
Inhibitor
Name:
BDBM50080400
Synonyms:
(2R,3R,4S,5R)-2-[2-Chloro-6-(piperidin-1-ylamino)-purin-9-yl]-5-hydroxymethyl-tetrahydro-furan-3,4-diol | CHEMBL423315
Type:
Small organic molecule
Emp. Form.:
C15H21ClN6O4
Mol. Mass.:
384.818
SMILES:
OC[C@H]1O[C@H]([C@H](O)[C@@H]1O)n1cnc2c(NN3CCCCC3)nc(Cl)nc12
: