Target
Complement C5
Ligand
BDBM19441
Substrate
Meas. Tech.
ChEMBL_1898128 (CHEMBL4400163)
Kd
710±n/a nM
Citation
 Mishra, RRana, S A rational search for discovering potential neutraligands of human complement fragment 5a ( Bioorg Med Chem 27:0 (2019)  
Target
Name:
Complement C5
Synonyms:
C3 and PZP-like alpha-2-macroglobulin domain-containing protein 4 C5a anaphylatoxin CPAMD4 Complement C5 alpha chain | Complement C5 beta chain
Type:
PROTEIN
Mol. Mass.:
188302.52
Organism:
Homo sapiens
Description:
ChEMBL_106142
Residue:
1676
  
Inhibitor
Name:
BDBM19441
Synonyms:
2-(4-hydroxyphenyl)-3-({4-[2-(piperidin-1-yl)ethoxy]phenyl}carbonyl)-1-benzothiophen-6-ol Evista RALOXIFENE HYDROCHLORIDE Raloxifene (7) [6-hydroxy-2-(4-hydroxyphenyl)-1-benzothiophen-3-yl]-[4-(2-piperidin-1-ylethoxy)phenyl]methanone | cid_11071264
Type:
Small organic molecule
Emp. Form.:
C28H27NO4S
Mol. Mass.:
473.583
SMILES:
Oc1ccc(cc1)-c1sc2cc(O)ccc2c1C(=O)c1ccc(OCCN2CCCCC2)cc1
: