Target
Kappa-type opioid receptor
Ligand
BDBM50080455
Substrate
Meas. Tech.
ChEMBL_146374 (CHEMBL754731)
Ki
>1000±n/a nM
Citation
 Schiller, PWFundytus, MEMerovitz, LWeltrowska, GNguyen, TMLemieux, CChung, NNCoderre, TJ The opioid mu agonist/delta antagonist DIPP-NH(2)[Psi] produces a potent analgesic effect, no physical dependence, and less tolerance than morphine in rats. J Med Chem 42:3520-6 (1999)  
Target
Name:
Kappa-type opioid receptor
Synonyms:
Kappa Opioid Receptor OPRK1 Opiate Kappa 1 | mu/kappa opioid receptor
Type:
G Protein-Coupled Receptor (GPCR)
Mol. Mass.:
42744.99
Organism:
Cavia porcellus (domestic guinea pig)
Description:
P41144
Residue:
380
  
Inhibitor
Name:
BDBM50080455
Synonyms:
(S)-N-((S)-1-Carbamoyl-2-phenyl-ethyl)-2-({2-[(S)-3-(4-hydroxy-2,6-dimethyl-phenyl)-2-methylamino-propionyl]-1,2,3,4-tetrahydro-isoquinolin-3-ylmethyl}-amino)-3-phenyl-propionamide | CHEMBL119535
Type:
Small organic molecule
Emp. Form.:
C40H47N5O4
Mol. Mass.:
661.8323
SMILES:
CN[C@@H](Cc1c(C)cc(O)cc1C)C(=O)N1Cc2ccccc2CC1CN[C@@H](Cc1ccccc1)C(=O)N[C@@H](Cc1ccccc1)C(N)=O
: