Target
Bifunctional epoxide hydrolase 2
Ligand
BDBM50351247
Substrate
Meas. Tech.
ChEMBL_1898247 (CHEMBL4400282)
IC50
0.400000±n/a nM
Citation
 Codony, SValverde, ELeiva, RBrea, JIsabel Loza, MMorisseau, CHammock, BDVázquez, S Exploring the size of the lipophilic unit of the soluble epoxide hydrolase inhibitors. Bioorg Med Chem 27:0 (2019)  
Target
Name:
Bifunctional epoxide hydrolase 2
Synonyms:
Cytosolic epoxide hydrolase 2 EPHX2 HYES_HUMAN Soluble epoxide hydrolase (sEH) | epoxide hydrolase 2, cytoplasmic
Type:
Enzyme
Mol. Mass.:
62613.07
Organism:
Homo sapiens (Human)
Description:
P34913
Residue:
555
  
Inhibitor
Name:
BDBM50351247
Synonyms:
CHEMBL1818385
Type:
Small organic molecule
Emp. Form.:
C17H19F3N2O
Mol. Mass.:
324.3408
SMILES:
Fc1ccc(NC(=O)NC23CC4CC(CC(C4)C2)C3)c(F)c1F
: