Target
Thymidylate synthase
Ligand
BDBM50081254
Substrate
Meas. Tech.
ChEMBL_209961 (CHEMBL820617)
IC50
13±n/a nM
Citation
 Marsham, PRWardleworth, JMBoyle, FTHennequin, LFKimbell, RBrown, MJackman, AL Design and synthesis of potent non-polyglutamatable quinazoline antifolate thymidylate synthase inhibitors. J Med Chem 42:3809-20 (1999)  
Target
Name:
Thymidylate synthase
Synonyms:
TS TYSY_MOUSE | Tyms
Type:
PROTEIN
Mol. Mass.:
34957.15
Organism:
Mus musculus
Description:
ChEMBL_1340097
Residue:
307
  
Inhibitor
Name:
BDBM50081254
Synonyms:
2-{4-[(2,7-Dimethyl-4-oxo-3,4-dihydro-quinazolin-6-ylmethyl)-prop-2-ynyl-amino]-2-fluoro-benzoylamino}-3-(3H-[1,2,3]triazol-4-ylsulfanyl)-propionic acid | CHEMBL441086
Type:
Small organic molecule
Emp. Form.:
C26H24FN7O4S
Mol. Mass.:
549.577
SMILES:
Cc1nc2cc(C)c(CN(CC#C)c3ccc(C(=O)NC(CSc4cnn[nH]4)C(O)=O)c(F)c3)cc2c(=O)[nH]1
: