Target
Dihydroorotate dehydrogenase (quinone), mitochondrial
Ligand
BDBM50018011
Substrate
Meas. Tech.
ChEMBL_1901273 (CHEMBL4403495)
IC50
50000±n/a nM
Citation
 Boschi, DPippione, ACSainas, SLolli, ML Dihydroorotate dehydrogenase inhibitors in anti-infective drug research. Eur J Med Chem 183:0 (2019)  
Target
Name:
Dihydroorotate dehydrogenase (quinone), mitochondrial
Synonyms:
1.3.5.2 | Dihydroorotate dehydrogenase (quinone), mitochondrial
Type:
PROTEIN
Mol. Mass.:
41300.36
Organism:
Schistosoma mansoni
Description:
ChEMBL_119667
Residue:
379
  
Inhibitor
Name:
BDBM50018011
Synonyms:
Aubagio HMR-1726 | TERIFLUNOMIDE
Type:
Small organic molecule
Emp. Form.:
C12H9F3N2O2
Mol. Mass.:
270.2073
SMILES:
C\C(O)=C(/C#N)C(=O)Nc1ccc(cc1)C(F)(F)F
: