Target
Sensory histidine kinase DcuS
Ligand
BDBM50020375
Substrate
Meas. Tech.
ChEMBL_1901353 (CHEMBL4403575)
IC50
2.9±n/a nM
Citation
 Horswill, ARGordon, CP Structure-Activity Relationship Studies of Small Molecule Modulators of the Staphylococcal Accessory Gene Regulator. J Med Chem 63:2705-2730 (2020)  
Target
Name:
Sensory histidine kinase DcuS
Synonyms:
Receptor-histidine kinase AgrC
Type:
PROTEIN
Mol. Mass.:
49890.25
Organism:
Staphylococcus aureus
Description:
ChEMBL_305973
Residue:
430
  
Inhibitor
Name:
BDBM50020375
Synonyms:
CHEMBL3289785
Type:
Small organic molecule
Emp. Form.:
C38H58N10O12S
Mol. Mass.:
878.992
SMILES:
CC(C)C[C@@H]1NC(=O)[C@H](CO)NC(=O)[C@H](CO)NC(=O)[C@H](CSC(=O)[C@H](Cc2ccccc2)NC1=O)NC(=O)[C@H](C)NC(=O)[C@H](CC(N)=O)NC(=O)[C@@H](NC(=O)CN)C(C)C
: